{"text_format":"1","workbook":"xlsx","n_sheets":6,"sheets":["Endkampf Mannschaften ","Endstand Mannschaften","Finale","Tiefschuss","Punkteverhältnis","Urkunden Einzel"],"not_rendered":{"charts":0,"images":1,"macros":1,"external_links":0,"defined_names":1,"comments":0,"pivot_tables":0},"unopened":[],"bounds":{"document_bytes":16777216,"sheet_cells":100000,"rows_first":2000,"rows_last":500,"rows_between":2000,"halvings":0,"cell_chars":16384,"cell_head_chars":4096},"cells_cut":0,"cells_raw":0,"read":"whole","date_system":"1900"}

{"sheet":"Endkampf Mannschaften ","index":0,"n_rows":41,"n_cols":13,"rows_kept":41,"cut":false,"hidden":false,"merged":[[38,11,39,11],[38,12,39,12],[14,11,15,11],[14,12,15,12],[0,0,0,12],[2,7,2,8],[5,11,6,11],[5,12,6,12],[22,11,23,11],[22,12,23,12],[30,11,31,11],[30,12,31,12]]}
["Mannschaftsergebnisse Endkampf Bezirksdamenschießen 2018 Auflage"]
[]
["Schützengau Kitzingen"]
["Namen","Gau","1. Serie","2. Serie","3. Serie","Ergebnis","Differenz","Tiefschuss","Punkte"]
["Wittel Monika",{"$f":"IF(A5>1,$A$3,\"\")","v":"Schützengau Kitzingen"},104.9,104.5,104.7,{"$f":"SUM(C5:E5)","v":314.10000000000002},{"$f":"IF(A5>1,327-F5,0)","v":12.899999999999977},15,{"$f":"IF(C5>1,SUM(G5:H5),0)","v":27.899999999999977},{"$f":"IF(A5>1,1,\"\")","v":1}]
["Bauer Birgit",{"$f":"IF(A6>1,$A$3,\"\")","v":"Schützengau Kitzingen"},102.5,102,105,{"$f":"SUM(C6:E6)","v":309.5},{"$f":"IF(A6>1,327-F6,0)","v":17.5},35.4,{"$f":"IF(C6>1,SUM(G6:H6),0)","v":52.9},{"$f":"IF(A6>1,1,\"\")","v":1},{"$f":"IF(K7=3,MAXA(I5:I7),0)","v":0},"Ergebnisse Vorkampf","Gesamt"]
[null,"",null,null,null,0,{"$f":"IF(A7>1,327-F7,0)","v":0},null,{"$f":"IF(C7>1,SUM(G7:H7),0)","v":0},"",{"$f":"COUNT(J5:J7)","v":2}]
[null,null,null,null,null,null,null,"Gesamt:",{"$f":"I5+I6+I7-K6","v":80.799999999999983},null,null,139.19999999999999,{"$f":"I8+L8","v":219.99999999999997}]
[]
[]
[]
["Schützengau Main-Spessart"]
["Namen","Gau","1. Serie","2. Serie","3. Serie","Ergebnis","Differenz","Tiefschuss","Punkte"]
["Oster Sigrid ",{"$f":"IF(A14>1,$A$12,\"\")","v":"Schützengau Main-Spessart"},104.4,103.3,103.7,{"$f":"SUM(C14:E14)","v":311.39999999999998},{"$f":"IF(A14>1,327-F14,0)","v":15.600000000000023},21.6,{"$f":"IF(C14>1,SUM(G14:H14),0)","v":37.200000000000024},{"$f":"IF(A14>1,1,\"\")","v":1}]
["Behl Herta",{"$f":"IF(A15>1,$A$12,\"\")","v":"Schützengau Main-Spessart"},103.7,102.3,101.1,307.10000000000002,{"$f":"IF(A15>1,327-F15,0)","v":19.899999999999977},43.1,{"$f":"IF(C15>1,SUM(G15:H15),0)","v":62.999999999999979},{"$f":"IF(A15>1,1,\"\")","v":1},{"$f":"IF(K16=3,MAXA(I14:I16),0)","v":0},"Ergebnisse Vorkampf","Gesamt"]
[null,"",null,null,null,0,{"$f":"IF(A16>1,327-F16,0)","v":0},null,0,"",{"$f":"COUNT(J14:J16)","v":2}]
[null,null," ",null,null,null,null,"Gesamt:",{"$f":"I14+I15+I16-K15","v":100.2},null,null,150.6,{"$f":"I17+L17","v":250.8}]
[]
[]
["Schützengau Rhön-Grabfeld"]
["Namen","Gau","1. Serie","2. Serie","3. Serie","Ergebnis","Differenz","Tiefschuss","Punkte"]
["Söder Helene",{"$f":"IF(A22>1,$A$20,\"\")","v":"Schützengau Rhön-Grabfeld"},100.5,99.1,101.5,{"$f":"SUM(C22:E22)","v":301.10000000000002},{"$f":"IF(A22>1,327-F22,0)","v":25.899999999999977},47.4,{"$f":"IF(C22>1,SUM(G22:H22),0)","v":73.299999999999983},{"$f":"IF(A22>1,1,\"\")","v":1}]
["nicht angetreten",{"$f":"IF(A23>1,$A$20,\"\")","v":"Schützengau Rhön-Grabfeld"},2,null,null,{"$f":"SUM(C23:E23)","v":2},{"$f":"IF(A23>1,327-F23,0)","v":325},1382.9,{"$f":"IF(C23>1,SUM(G23:H23),0)","v":1707.9},{"$f":"IF(A23>1,1,\"\")","v":1},{"$f":"IF(K24=3,MAXA(I22:I24),0)","v":0},"Ergebnisse Vorkampf","Gesamt"]
[null,"",null,null,null,0,0,null,0,"",{"$f":"COUNT(J22:J24)","v":2}]
[null,null," ",null,null,null,null,"Gesamt:",{"$f":"I22+I23+I24-K23","v":1781.2},null,null,218.8,{"$f":"I25+L25","v":2000}]
[]
[]
["Schützengau Schweinfurt"]
["Namen","Gau","1. Serie","2. Serie","3. Serie","Ergebnis","Differenz","Tiefschuss","Punkte"]
["Reichert Christine",{"$f":"IF(A30>1,$A$28,\"\")","v":"Schützengau Schweinfurt"},102.3,97.7,100.9,{"$f":"SUM(C30:E30)","v":300.89999999999998},{"$f":"IF(A30>1,327-F30,0)","v":26.100000000000023},48.8,{"$f":"IF(C30>1,SUM(G30:H30),0)","v":74.90000000000002},{"$f":"IF(A30>1,1,\"\")","v":1}]
["Sittler Gudrun",{"$f":"IF(A31>1,$A$28,\"\")","v":"Schützengau Schweinfurt"},102.6,102.9,102.2,{"$f":"SUM(C31:E31)","v":307.7},{"$f":"IF(A31>1,327-F31,0)","v":19.300000000000011},32,{"$f":"IF(C31>1,SUM(G31:H31),0)","v":51.300000000000011},{"$f":"IF(A31>1,1,\"\")","v":1},{"$f":"IF(K32=3,MAXA(I30:I32),0)","v":74.90000000000002},"Ergebnisse Vorkampf","Gesamt"]
["Schad Roswitha","Schützengau Schweinfurt",105.8,99.7,105.6,{"$f":"SUM(C32:E32)","v":311.10000000000002},{"$f":"IF(A32>1,327-F32,0)","v":15.899999999999977},33.5,49.399999999999977,1,{"$f":"COUNT(J30:J32)","v":3}]
[null,null," ",null,null,null,null,"Gesamt:",{"$f":"I30+I31+I32-K31","v":100.7},null,null,211.2,{"$f":"L33+I33","v":311.89999999999998}]
[]
[]
["Schützengau Rhön-Saale"]
["Namen","Gau","1. Serie","2. Serie","3. Serie","Ergebnis","Differenz","Tiefschuss","Punkte"]
["nicht angetreten",{"$f":"IF(A38>1,$A$36,\"\")","v":"Schützengau Rhön-Saale"},2,null,null,{"$f":"SUM(C38:E38)","v":2},{"$f":"IF(A38>1,327-F38,0)","v":325},1317.6,{"$f":"IF(C38>1,SUM(G38:H38),0)","v":1642.6},{"$f":"IF(A38>1,1,\"\")","v":1}]
[null,{"$f":"IF(A39>1,$A$36,\"\")","v":""},null,null,null,{"$f":"SUM(C39:E39)","v":0},{"$f":"IF(A39>1,327-F39,0)","v":0},null,{"$f":"IF(C39>1,SUM(G39:H39),0)","v":0},{"$f":"IF(A39>1,1,\"\")","v":""},{"$f":"IF(K40=3,MAXA(I38:I40),0)","v":0},"Ergebnisse Vorkampf","Gesamt"]
[null,"",null,null,null,{"$f":"SUM(C40:E40)","v":0},{"$f":"IF(A40>1,327-F40,0)","v":0},null,0,"",{"$f":"COUNT(J38:J40)","v":1}]
[null,null," ",null,null,null,null,"Gesamt:",{"$f":"I38+I39+I40-K39","v":1642.6},null,null,357.4,{"$f":"L41+I41","v":2000}]

{"sheet":"Endstand Mannschaften","index":1,"n_rows":6,"n_cols":6,"rows_kept":6,"cut":false,"hidden":false,"merged":[]}
["Platz","Gau","1. Schützin","2. Schützin","3. Schützin","Punkte"]
["1.",{"$f":"'Endkampf Mannschaften '!A3","v":"Schützengau Kitzingen"},{"$f":"'Endkampf Mannschaften '!A5","v":"Wittel Monika"},{"$f":"'Endkampf Mannschaften '!A6","v":"Bauer Birgit"},{"$f":"'Endkampf Mannschaften '!A7","v":0},{"$f":"'Endkampf Mannschaften '!M8","v":219.99999999999997}]
["2.",{"$f":"'Endkampf Mannschaften '!A12","v":"Schützengau Main-Spessart"},{"$f":"'Endkampf Mannschaften '!A14","v":"Oster Sigrid "},{"$f":"'Endkampf Mannschaften '!A15","v":"Behl Herta"},{"$f":"'Endkampf Mannschaften '!A16","v":0},{"$f":"'Endkampf Mannschaften '!M17","v":250.8}]
["3.",{"$f":"'Endkampf Mannschaften '!A28","v":"Schützengau Schweinfurt"},{"$f":"'Endkampf Mannschaften '!A30","v":"Reichert Christine"},{"$f":"'Endkampf Mannschaften '!A31","v":"Sittler Gudrun"},{"$f":"'Endkampf Mannschaften '!A32","v":"Schad Roswitha"},{"$f":"'Endkampf Mannschaften '!M33","v":311.89999999999998}]
["4.",{"$f":"'Endkampf Mannschaften '!A36","v":"Schützengau Rhön-Saale"}]
["5.",{"$f":"'Endkampf Mannschaften '!A20","v":"Schützengau Rhön-Grabfeld"}]

{"sheet":"Finale","index":2,"n_rows":11,"n_cols":16,"rows_kept":11,"cut":false,"hidden":false,"merged":[]}
[null,"Bezirksdamenschießen 2018",null,null,null,null,null,null,null,"Finalschießen - Auflage"]
[]
[null,"Platz","Name","Gau","Ergebnis Vorkampf","1. Schuss","2. Schuss","3. Schuss","4. Schuss","5. Schuss","6. Schuss","7. Schuss","8. Schuss","9. Schuss","10. Schuss","Gesamt"]
[null,1,{"$f":"Punkteverhältnis!B4","v":"Wittel Monika"},{"$f":"Punkteverhältnis!C4","v":"Schützengau Kitzingen"},{"$f":"Punkteverhältnis!J4","v":27.899999999999977},10.5,10.4,10.6,10.5,10.7,10.4,10.6,10.8,10.7,10.6,{"$f":"SUM(F4:O4)","v":105.8}]
[null,2,{"$f":"Punkteverhältnis!B8","v":"Bauer Birgit"},{"$f":"Punkteverhältnis!C8","v":"Schützengau Kitzingen"},{"$f":"Punkteverhältnis!J8","v":52.9},10.7,10,10.5,10.9,10,10.199999999999999,10.7,10.7,10.3,10.199999999999999,104.2]
[null,3,{"$f":"Punkteverhältnis!B6","v":"Schad Roswitha"},{"$f":"Punkteverhältnis!C6","v":"Schützengau Schweinfurt"},{"$f":"Punkteverhältnis!J6","v":49.399999999999977},9.8000000000000007,10.5,10.7,10.6,10.5,10.6,10.5,10.199999999999999,10.1,10.6,104.1]
[null,4,{"$f":"Punkteverhältnis!B5","v":"Oster Sigrid "},{"$f":"Punkteverhältnis!C5","v":"Schützengau Main-Spessart"},{"$f":"Punkteverhältnis!J5","v":37.200000000000024},10,10.3,10.1,10.4,10.8,10.4,10.4,10.8,10,10.6,103.79999999999998]
[null,5,{"$f":"Punkteverhältnis!B11","v":"Reichert Christine"},{"$f":"Punkteverhältnis!C11","v":"Schützengau Schweinfurt"},{"$f":"Punkteverhältnis!J11","v":74.90000000000002},10.7,10.3,10.4,9.6,9.8000000000000007,10.5,10,10.4,10.199999999999999,10.199999999999999,102.10000000000001]
[null,6,{"$f":"Punkteverhältnis!B7","v":"Sittler Gudrun"},{"$f":"Punkteverhältnis!C7","v":"Schützengau Schweinfurt"},{"$f":"Punkteverhältnis!J7","v":51.300000000000011},9.8000000000000007,10.1,10.1,10,10.7,10.4,10.1,9.6,10.199999999999999,10.6,101.6]
[null,7,{"$f":"Punkteverhältnis!B10","v":"Söder Helene"},{"$f":"Punkteverhältnis!C10","v":"Schützengau Rhön-Grabfeld"},{"$f":"Punkteverhältnis!J10","v":73.299999999999983},10.8,10.7,10.4,9.6999999999999993,10.199999999999999,9.1,10.6,10.7,9.8000000000000007,9.6,101.6]
[null,8,{"$f":"Punkteverhältnis!B9","v":"Behl Herta"},{"$f":"Punkteverhältnis!C9","v":"Schützengau Main-Spessart"},{"$f":"Punkteverhältnis!J9","v":62.999999999999979},10.6,9.6999999999999993,9.4,9.8000000000000007,10.6,9.6999999999999993,9.8000000000000007,9.9,9.8000000000000007,10.8,100.1]

{"sheet":"Tiefschuss","index":3,"n_rows":11,"n_cols":10,"rows_kept":11,"cut":false,"hidden":false,"merged":[[0,0,0,9]]}
["Einzelergebnisse Endkampf Bezirksdamenschießen 2018"]
["Bester Tiefschuß (Auflage)"]
["Platz","Name","Gau","1. Serie","2. Serie","3. Serie","Ergebnis","Differenz","Tiefschuss","Punkte"]
["1.",{"$f":"'Endkampf Mannschaften '!A5","v":"Wittel Monika"},{"$f":"'Endkampf Mannschaften '!B5","v":"Schützengau Kitzingen"},{"$f":"'Endkampf Mannschaften '!C5","v":104.9},{"$f":"'Endkampf Mannschaften '!D5","v":104.5},{"$f":"'Endkampf Mannschaften '!E5","v":104.7},{"$f":"'Endkampf Mannschaften '!F5","v":314.10000000000002},{"$f":"'Endkampf Mannschaften '!G5","v":12.899999999999977},{"$f":"'Endkampf Mannschaften '!H5","v":15},{"$f":"'Endkampf Mannschaften '!I5","v":27.899999999999977}]
["2.",{"$f":"'Endkampf Mannschaften '!A14","v":"Oster Sigrid "},{"$f":"'Endkampf Mannschaften '!B14","v":"Schützengau Main-Spessart"},{"$f":"'Endkampf Mannschaften '!C14","v":104.4},{"$f":"'Endkampf Mannschaften '!D14","v":103.3},{"$f":"'Endkampf Mannschaften '!E14","v":103.7},{"$f":"'Endkampf Mannschaften '!F14","v":311.39999999999998},{"$f":"'Endkampf Mannschaften '!G14","v":15.600000000000023},{"$f":"'Endkampf Mannschaften '!H14","v":21.6},{"$f":"'Endkampf Mannschaften '!I14","v":37.200000000000024}]
["3.",{"$f":"'Endkampf Mannschaften '!A31","v":"Sittler Gudrun"},{"$f":"'Endkampf Mannschaften '!B31","v":"Schützengau Schweinfurt"},{"$f":"'Endkampf Mannschaften '!C31","v":102.6},{"$f":"'Endkampf Mannschaften '!D31","v":102.9},{"$f":"'Endkampf Mannschaften '!E31","v":102.2},{"$f":"'Endkampf Mannschaften '!F31","v":307.7},{"$f":"'Endkampf Mannschaften '!G31","v":19.300000000000011},{"$f":"'Endkampf Mannschaften '!H31","v":32},{"$f":"'Endkampf Mannschaften '!I31","v":51.300000000000011}]
["4.",{"$f":"'Endkampf Mannschaften '!A32","v":"Schad Roswitha"},{"$f":"'Endkampf Mannschaften '!B32","v":"Schützengau Schweinfurt"},{"$f":"'Endkampf Mannschaften '!C32","v":105.8},{"$f":"'Endkampf Mannschaften '!D32","v":99.7},{"$f":"'Endkampf Mannschaften '!E32","v":105.6},{"$f":"'Endkampf Mannschaften '!F32","v":311.10000000000002},{"$f":"'Endkampf Mannschaften '!G32","v":15.899999999999977},{"$f":"'Endkampf Mannschaften '!H32","v":33.5},{"$f":"'Endkampf Mannschaften '!I32","v":49.399999999999977}]
["5.",{"$f":"'Endkampf Mannschaften '!A6","v":"Bauer Birgit"},{"$f":"'Endkampf Mannschaften '!B6","v":"Schützengau Kitzingen"},{"$f":"'Endkampf Mannschaften '!C6","v":102.5},{"$f":"'Endkampf Mannschaften '!D6","v":102},{"$f":"'Endkampf Mannschaften '!E6","v":105},{"$f":"'Endkampf Mannschaften '!F6","v":309.5},{"$f":"'Endkampf Mannschaften '!G6","v":17.5},{"$f":"'Endkampf Mannschaften '!H6","v":35.4},{"$f":"'Endkampf Mannschaften '!I6","v":52.9}]
["6.",{"$f":"'Endkampf Mannschaften '!A15","v":"Behl Herta"},{"$f":"'Endkampf Mannschaften '!B15","v":"Schützengau Main-Spessart"},{"$f":"'Endkampf Mannschaften '!C15","v":103.7},{"$f":"'Endkampf Mannschaften '!D15","v":102.3},{"$f":"'Endkampf Mannschaften '!E15","v":101.1},{"$f":"'Endkampf Mannschaften '!F15","v":307.10000000000002},{"$f":"'Endkampf Mannschaften '!G15","v":19.899999999999977},{"$f":"'Endkampf Mannschaften '!H15","v":43.1},{"$f":"'Endkampf Mannschaften '!I15","v":62.999999999999979}]
["7.",{"$f":"'Endkampf Mannschaften '!A22","v":"Söder Helene"},{"$f":"'Endkampf Mannschaften '!B22","v":"Schützengau Rhön-Grabfeld"},{"$f":"'Endkampf Mannschaften '!C22","v":100.5},{"$f":"'Endkampf Mannschaften '!D22","v":99.1},{"$f":"'Endkampf Mannschaften '!E22","v":101.5},{"$f":"'Endkampf Mannschaften '!F22","v":301.10000000000002},{"$f":"'Endkampf Mannschaften '!G22","v":25.899999999999977},{"$f":"'Endkampf Mannschaften '!H22","v":47.4},{"$f":"'Endkampf Mannschaften '!I22","v":73.299999999999983}]
["8.",{"$f":"'Endkampf Mannschaften '!A30","v":"Reichert Christine"},{"$f":"'Endkampf Mannschaften '!B30","v":"Schützengau Schweinfurt"},{"$f":"'Endkampf Mannschaften '!C30","v":102.3},{"$f":"'Endkampf Mannschaften '!D30","v":97.7},{"$f":"'Endkampf Mannschaften '!E30","v":100.9},{"$f":"'Endkampf Mannschaften '!F30","v":300.89999999999998},{"$f":"'Endkampf Mannschaften '!G30","v":26.100000000000023},{"$f":"'Endkampf Mannschaften '!H30","v":48.8},{"$f":"'Endkampf Mannschaften '!I30","v":74.90000000000002}]

{"sheet":"Punkteverhältnis","index":4,"n_rows":11,"n_cols":10,"rows_kept":11,"cut":false,"hidden":false,"merged":[[0,0,0,9]]}
["Einzelergebnisse Endkampf Bezirksdamenschießen 2018"]
["Bestes Punkteverhältnis (Auflage)"]
["Platz","Name","Gau","1. Serie","2. Serie","3. Serie","Ergebnis","Differenz","Tiefschuss","Punkte"]
["1.",{"$f":"'Endkampf Mannschaften '!A5","v":"Wittel Monika"},{"$f":"'Endkampf Mannschaften '!B5","v":"Schützengau Kitzingen"},{"$f":"'Endkampf Mannschaften '!C5","v":104.9},{"$f":"'Endkampf Mannschaften '!D5","v":104.5},{"$f":"'Endkampf Mannschaften '!E5","v":104.7},{"$f":"'Endkampf Mannschaften '!F5","v":314.10000000000002},{"$f":"'Endkampf Mannschaften '!G5","v":12.899999999999977},{"$f":"'Endkampf Mannschaften '!H5","v":15},{"$f":"'Endkampf Mannschaften '!I5","v":27.899999999999977}]
["2.",{"$f":"'Endkampf Mannschaften '!A14","v":"Oster Sigrid "},{"$f":"'Endkampf Mannschaften '!B14","v":"Schützengau Main-Spessart"},{"$f":"'Endkampf Mannschaften '!C14","v":104.4},{"$f":"'Endkampf Mannschaften '!D14","v":103.3},{"$f":"'Endkampf Mannschaften '!E14","v":103.7},{"$f":"'Endkampf Mannschaften '!F14","v":311.39999999999998},{"$f":"'Endkampf Mannschaften '!G14","v":15.600000000000023},{"$f":"'Endkampf Mannschaften '!H14","v":21.6},{"$f":"'Endkampf Mannschaften '!I14","v":37.200000000000024}]
["3.",{"$f":"'Endkampf Mannschaften '!A32","v":"Schad Roswitha"},{"$f":"'Endkampf Mannschaften '!B32","v":"Schützengau Schweinfurt"},{"$f":"'Endkampf Mannschaften '!C32","v":105.8},{"$f":"'Endkampf Mannschaften '!D32","v":99.7},{"$f":"'Endkampf Mannschaften '!E32","v":105.6},{"$f":"'Endkampf Mannschaften '!F32","v":311.10000000000002},{"$f":"'Endkampf Mannschaften '!G32","v":15.899999999999977},{"$f":"'Endkampf Mannschaften '!H32","v":33.5},{"$f":"'Endkampf Mannschaften '!I32","v":49.399999999999977}]
["4.",{"$f":"'Endkampf Mannschaften '!A31","v":"Sittler Gudrun"},{"$f":"'Endkampf Mannschaften '!B31","v":"Schützengau Schweinfurt"},{"$f":"'Endkampf Mannschaften '!C31","v":102.6},{"$f":"'Endkampf Mannschaften '!D31","v":102.9},{"$f":"'Endkampf Mannschaften '!E31","v":102.2},{"$f":"'Endkampf Mannschaften '!F31","v":307.7},{"$f":"'Endkampf Mannschaften '!G31","v":19.300000000000011},{"$f":"'Endkampf Mannschaften '!H31","v":32},{"$f":"'Endkampf Mannschaften '!I31","v":51.300000000000011}]
["5.",{"$f":"'Endkampf Mannschaften '!A6","v":"Bauer Birgit"},{"$f":"'Endkampf Mannschaften '!B6","v":"Schützengau Kitzingen"},{"$f":"'Endkampf Mannschaften '!C6","v":102.5},{"$f":"'Endkampf Mannschaften '!D6","v":102},{"$f":"'Endkampf Mannschaften '!E6","v":105},{"$f":"'Endkampf Mannschaften '!F6","v":309.5},{"$f":"'Endkampf Mannschaften '!G6","v":17.5},{"$f":"'Endkampf Mannschaften '!H6","v":35.4},{"$f":"'Endkampf Mannschaften '!I6","v":52.9}]
["6.",{"$f":"'Endkampf Mannschaften '!A15","v":"Behl Herta"},{"$f":"'Endkampf Mannschaften '!B15","v":"Schützengau Main-Spessart"},{"$f":"'Endkampf Mannschaften '!C15","v":103.7},{"$f":"'Endkampf Mannschaften '!D15","v":102.3},{"$f":"'Endkampf Mannschaften '!E15","v":101.1},{"$f":"'Endkampf Mannschaften '!F15","v":307.10000000000002},{"$f":"'Endkampf Mannschaften '!G15","v":19.899999999999977},{"$f":"'Endkampf Mannschaften '!H15","v":43.1},{"$f":"'Endkampf Mannschaften '!I15","v":62.999999999999979}]
["7.",{"$f":"'Endkampf Mannschaften '!A22","v":"Söder Helene"},{"$f":"'Endkampf Mannschaften '!B22","v":"Schützengau Rhön-Grabfeld"},{"$f":"'Endkampf Mannschaften '!C22","v":100.5},{"$f":"'Endkampf Mannschaften '!D22","v":99.1},{"$f":"'Endkampf Mannschaften '!E22","v":101.5},{"$f":"'Endkampf Mannschaften '!F22","v":301.10000000000002},{"$f":"'Endkampf Mannschaften '!G22","v":25.899999999999977},{"$f":"'Endkampf Mannschaften '!H22","v":47.4},{"$f":"'Endkampf Mannschaften '!I22","v":73.299999999999983}]
["8.",{"$f":"'Endkampf Mannschaften '!A30","v":"Reichert Christine"},{"$f":"'Endkampf Mannschaften '!B30","v":"Schützengau Schweinfurt"},{"$f":"'Endkampf Mannschaften '!C30","v":102.3},{"$f":"'Endkampf Mannschaften '!D30","v":97.7},{"$f":"'Endkampf Mannschaften '!E30","v":100.9},{"$f":"'Endkampf Mannschaften '!F30","v":300.89999999999998},{"$f":"'Endkampf Mannschaften '!G30","v":26.100000000000023},{"$f":"'Endkampf Mannschaften '!H30","v":48.8},{"$f":"'Endkampf Mannschaften '!I30","v":74.90000000000002}]

{"sheet":"Urkunden Einzel","index":5,"n_rows":16,"n_cols":10,"rows_kept":16,"cut":false,"hidden":false,"merged":[]}
["Platz","Name","Gau","1. Serie","2. Serie","3. Serie","Ergebnis","Differenz","Tiefschuss","Punkte"]
[{"$f":"Punkteverhältnis!A4","v":"1."},{"$f":"Punkteverhältnis!B4","v":"Wittel Monika"},{"$f":"Punkteverhältnis!C4","v":"Schützengau Kitzingen"},{"$f":"Punkteverhältnis!D4","v":104.9},{"$f":"Punkteverhältnis!E4","v":104.5},{"$f":"Punkteverhältnis!F4","v":104.7},{"$f":"Punkteverhältnis!G4","v":314.10000000000002},{"$f":"Punkteverhältnis!H4","v":12.899999999999977},{"$f":"Punkteverhältnis!I4","v":15},{"$f":"Punkteverhältnis!J4","v":27.899999999999977}]
[{"$f":"Punkteverhältnis!A5","v":"2."},{"$f":"Punkteverhältnis!B5","v":"Oster Sigrid "},{"$f":"Punkteverhältnis!C5","v":"Schützengau Main-Spessart"},{"$f":"Punkteverhältnis!D5","v":104.4},{"$f":"Punkteverhältnis!E5","v":103.3},{"$f":"Punkteverhältnis!F5","v":103.7},{"$f":"Punkteverhältnis!G5","v":311.39999999999998},{"$f":"Punkteverhältnis!H5","v":15.600000000000023},{"$f":"Punkteverhältnis!I5","v":21.6},{"$f":"Punkteverhältnis!J5","v":37.200000000000024}]
[{"$f":"Punkteverhältnis!#REF!","v":{"$error":"#REF!"}},{"$f":"Punkteverhältnis!#REF!","v":{"$error":"#REF!"}},{"$f":"Punkteverhältnis!#REF!","v":{"$error":"#REF!"}},{"$f":"Punkteverhältnis!#REF!","v":{"$error":"#REF!"}},{"$f":"Punkteverhältnis!#REF!","v":{"$error":"#REF!"}},{"$f":"Punkteverhältnis!#REF!","v":{"$error":"#REF!"}},{"$f":"Punkteverhältnis!#REF!","v":{"$error":"#REF!"}},{"$f":"Punkteverhältnis!#REF!","v":{"$error":"#REF!"}},{"$f":"Punkteverhältnis!#REF!","v":{"$error":"#REF!"}},{"$f":"Punkteverhältnis!#REF!","v":{"$error":"#REF!"}}]
[{"$f":"Punkteverhältnis!A6","v":"3."},{"$f":"Punkteverhältnis!B6","v":"Schad Roswitha"},{"$f":"Punkteverhältnis!C6","v":"Schützengau Schweinfurt"},{"$f":"Punkteverhältnis!D6","v":105.8},{"$f":"Punkteverhältnis!E6","v":99.7},{"$f":"Punkteverhältnis!F6","v":105.6},{"$f":"Punkteverhältnis!G6","v":311.10000000000002},{"$f":"Punkteverhältnis!H6","v":15.899999999999977},{"$f":"Punkteverhältnis!I6","v":33.5},{"$f":"Punkteverhältnis!J6","v":49.399999999999977}]
[{"$f":"Punkteverhältnis!A7","v":"4."},{"$f":"Punkteverhältnis!B7","v":"Sittler Gudrun"},{"$f":"Punkteverhältnis!C7","v":"Schützengau Schweinfurt"},{"$f":"Punkteverhältnis!D7","v":102.6},{"$f":"Punkteverhältnis!E7","v":102.9},{"$f":"Punkteverhältnis!F7","v":102.2},{"$f":"Punkteverhältnis!G7","v":307.7},{"$f":"Punkteverhältnis!H7","v":19.300000000000011},{"$f":"Punkteverhältnis!I7","v":32},{"$f":"Punkteverhältnis!J7","v":51.300000000000011}]
[{"$f":"Punkteverhältnis!#REF!","v":{"$error":"#REF!"}},{"$f":"Punkteverhältnis!#REF!","v":{"$error":"#REF!"}},{"$f":"Punkteverhältnis!#REF!","v":{"$error":"#REF!"}},{"$f":"Punkteverhältnis!#REF!","v":{"$error":"#REF!"}},{"$f":"Punkteverhältnis!#REF!","v":{"$error":"#REF!"}},{"$f":"Punkteverhältnis!#REF!","v":{"$error":"#REF!"}},{"$f":"Punkteverhältnis!#REF!","v":{"$error":"#REF!"}},{"$f":"Punkteverhältnis!#REF!","v":{"$error":"#REF!"}},{"$f":"Punkteverhältnis!#REF!","v":{"$error":"#REF!"}},{"$f":"Punkteverhältnis!#REF!","v":{"$error":"#REF!"}}]
[{"$f":"Punkteverhältnis!A8","v":"5."},{"$f":"Punkteverhältnis!B8","v":"Bauer Birgit"},{"$f":"Punkteverhältnis!C8","v":"Schützengau Kitzingen"},{"$f":"Punkteverhältnis!D8","v":102.5},{"$f":"Punkteverhältnis!E8","v":102},{"$f":"Punkteverhältnis!F8","v":105},{"$f":"Punkteverhältnis!G8","v":309.5},{"$f":"Punkteverhältnis!H8","v":17.5},{"$f":"Punkteverhältnis!I8","v":35.4},{"$f":"Punkteverhältnis!J8","v":52.9}]
[{"$f":"Punkteverhältnis!#REF!","v":{"$error":"#REF!"}},{"$f":"Punkteverhältnis!#REF!","v":{"$error":"#REF!"}},{"$f":"Punkteverhältnis!#REF!","v":{"$error":"#REF!"}},{"$f":"Punkteverhältnis!#REF!","v":{"$error":"#REF!"}},{"$f":"Punkteverhältnis!#REF!","v":{"$error":"#REF!"}},{"$f":"Punkteverhältnis!#REF!","v":{"$error":"#REF!"}},{"$f":"Punkteverhältnis!#REF!","v":{"$error":"#REF!"}},{"$f":"Punkteverhältnis!#REF!","v":{"$error":"#REF!"}},{"$f":"Punkteverhältnis!#REF!","v":{"$error":"#REF!"}},{"$f":"Punkteverhältnis!#REF!","v":{"$error":"#REF!"}}]
[{"$f":"Punkteverhältnis!#REF!","v":{"$error":"#REF!"}},{"$f":"Punkteverhältnis!#REF!","v":{"$error":"#REF!"}},{"$f":"Punkteverhältnis!#REF!","v":{"$error":"#REF!"}},{"$f":"Punkteverhältnis!#REF!","v":{"$error":"#REF!"}},{"$f":"Punkteverhältnis!#REF!","v":{"$error":"#REF!"}},{"$f":"Punkteverhältnis!#REF!","v":{"$error":"#REF!"}},{"$f":"Punkteverhältnis!#REF!","v":{"$error":"#REF!"}},{"$f":"Punkteverhältnis!#REF!","v":{"$error":"#REF!"}},{"$f":"Punkteverhältnis!#REF!","v":{"$error":"#REF!"}},{"$f":"Punkteverhältnis!#REF!","v":{"$error":"#REF!"}}]
[{"$f":"Punkteverhältnis!A9","v":"6."},{"$f":"Punkteverhältnis!B9","v":"Behl Herta"},{"$f":"Punkteverhältnis!C9","v":"Schützengau Main-Spessart"},{"$f":"Punkteverhältnis!D9","v":103.7},{"$f":"Punkteverhältnis!E9","v":102.3},{"$f":"Punkteverhältnis!F9","v":101.1},{"$f":"Punkteverhältnis!G9","v":307.10000000000002},{"$f":"Punkteverhältnis!H9","v":19.899999999999977},{"$f":"Punkteverhältnis!I9","v":43.1},{"$f":"Punkteverhältnis!J9","v":62.999999999999979}]
[{"$f":"Punkteverhältnis!A10","v":"7."},{"$f":"Punkteverhältnis!B10","v":"Söder Helene"},{"$f":"Punkteverhältnis!C10","v":"Schützengau Rhön-Grabfeld"},{"$f":"Punkteverhältnis!D10","v":100.5},{"$f":"Punkteverhältnis!E10","v":99.1},{"$f":"Punkteverhältnis!F10","v":101.5},{"$f":"Punkteverhältnis!G10","v":301.10000000000002},{"$f":"Punkteverhältnis!H10","v":25.899999999999977},{"$f":"Punkteverhältnis!I10","v":47.4},{"$f":"Punkteverhältnis!J10","v":73.299999999999983}]
[{"$f":"Punkteverhältnis!A11","v":"8."},{"$f":"Punkteverhältnis!B11","v":"Reichert Christine"},{"$f":"Punkteverhältnis!C11","v":"Schützengau Schweinfurt"},{"$f":"Punkteverhältnis!D11","v":102.3},{"$f":"Punkteverhältnis!E11","v":97.7},{"$f":"Punkteverhältnis!F11","v":100.9},{"$f":"Punkteverhältnis!G11","v":300.89999999999998},{"$f":"Punkteverhältnis!H11","v":26.100000000000023},{"$f":"Punkteverhältnis!I11","v":48.8},{"$f":"Punkteverhältnis!J11","v":74.90000000000002}]
[{"$f":"Punkteverhältnis!#REF!","v":{"$error":"#REF!"}},{"$f":"Punkteverhältnis!#REF!","v":{"$error":"#REF!"}},{"$f":"Punkteverhältnis!#REF!","v":{"$error":"#REF!"}},{"$f":"Punkteverhältnis!#REF!","v":{"$error":"#REF!"}},{"$f":"Punkteverhältnis!#REF!","v":{"$error":"#REF!"}},{"$f":"Punkteverhältnis!#REF!","v":{"$error":"#REF!"}},{"$f":"Punkteverhältnis!#REF!","v":{"$error":"#REF!"}},{"$f":"Punkteverhältnis!#REF!","v":{"$error":"#REF!"}},{"$f":"Punkteverhältnis!#REF!","v":{"$error":"#REF!"}},{"$f":"Punkteverhältnis!#REF!","v":{"$error":"#REF!"}}]
[{"$f":"Punkteverhältnis!#REF!","v":{"$error":"#REF!"}},{"$f":"Punkteverhältnis!#REF!","v":{"$error":"#REF!"}},{"$f":"Punkteverhältnis!#REF!","v":{"$error":"#REF!"}},{"$f":"Punkteverhältnis!#REF!","v":{"$error":"#REF!"}},{"$f":"Punkteverhältnis!#REF!","v":{"$error":"#REF!"}},{"$f":"Punkteverhältnis!#REF!","v":{"$error":"#REF!"}},{"$f":"Punkteverhältnis!#REF!","v":{"$error":"#REF!"}},{"$f":"Punkteverhältnis!#REF!","v":{"$error":"#REF!"}},{"$f":"Punkteverhältnis!#REF!","v":{"$error":"#REF!"}},{"$f":"Punkteverhältnis!#REF!","v":{"$error":"#REF!"}}]
[{"$f":"Punkteverhältnis!#REF!","v":{"$error":"#REF!"}},{"$f":"Punkteverhältnis!#REF!","v":{"$error":"#REF!"}},{"$f":"Punkteverhältnis!#REF!","v":{"$error":"#REF!"}},{"$f":"Punkteverhältnis!#REF!","v":{"$error":"#REF!"}},{"$f":"Punkteverhältnis!#REF!","v":{"$error":"#REF!"}},{"$f":"Punkteverhältnis!#REF!","v":{"$error":"#REF!"}},{"$f":"Punkteverhältnis!#REF!","v":{"$error":"#REF!"}},{"$f":"Punkteverhältnis!#REF!","v":{"$error":"#REF!"}},{"$f":"Punkteverhältnis!#REF!","v":{"$error":"#REF!"}},{"$f":"Punkteverhältnis!#REF!","v":{"$error":"#REF!"}}]